Reaction Details
TargetDihydrofolate reductase
LigandBDBM50130313
Substrate/Competitorn/a
Meas. Tech.ChEMBL_138607 (CHEMBL746911)
Ki 333±n/a nM
Citation Pineda, PKanter, AMcIvor, RSBenkovic, SJRosowsky, AWagner, CR Dihydrofolate reductase mutant with exceptional resistance to methotrexate but not to trimetrexate. J Med Chem46:2816-8 (2003) 
 
Dihydrofolate reductase
Name:Dihydrofolate reductase
Type:Enzyme
Mol. Mass.:21608.82
Organism:Mus musculus (Mouse)
Description:n/a
Residue:187
BDBM50130313
NameBDBM50130313
Synonyms:2-{4-[(2,4-Diamino-pteridin-6-ylmethyl)-methyl-amino]-benzoylamino}-succinic acid | CHEMBL328499
TypeSmall organic molecule
Emp. Form.C19H20N8O5
Mol. Mass.440.4127
SMILESCN(Cc1cnc2nc(N)nc(N)c2n1)c1ccc(cc1)C(=O)NC(CC(O)=O)C(O)=O