Reaction Details
TargetAdenosine receptor A2b
LigandBDBM50268107
Substrate/Competitorn/a
Meas. Tech.ChEMBL_2094398 (CHEMBL4775661)
Ki 0.500000±n/a nM
Citation Majellaro, MJespers, WCrespo, ANúñez, MJNovio, SAzuaje, JPrieto-Díaz, RGioé, CAlispahic, BBrea, JLoza, MIFreire-Garabal, MGarcia-Santiago, CRodríguez-García, CGarcía-Mera, XCaamaño, OFernandez-Masaguer, CSardina, JFStefanachi, AEl Maatougui, AMallo-Abreu, AÅqvist, JGutiérrez-de-Terán, HSotelo, E 3,4-Dihydropyrimidin-2(1 J Med Chem64:458-480 (2021) 
 
Adenosine receptor A2b
Name:Adenosine receptor A2b
Type:G Protein-Coupled Receptor (GPCR)
Mol. Mass.:36341.22
Organism:Homo sapiens (Human)
Description:n/a
Residue:332
BDBM50268107
NameBDBM50268107
Synonyms:CHEMBL485862 N-(2-(2-phenyl-6-(4-(3-phenylpropyl)piperazine-1-carbonyl)-7H-pyrrolo[2,3-d]pyrimidin-4-ylamino)ethyl)acetamide | OSIP-339391
TypeSmall organic molecule
Emp. Form.C30H35N7O2
Mol. Mass.525.6446
SMILESCC(=O)NCCNc1nc(nc2[nH]c(cc12)C(=O)N1CCN(CCCc2ccccc2)CC1)-c1ccccc1