Reaction Details
TargetAdenosine receptor A2a
LigandBDBM21173
Substrate/Competitorn/a
Meas. Tech.ChEMBL_2094399 (CHEMBL4775662)
Ki 157±n/a nM
Citation Majellaro, MJespers, WCrespo, ANúñez, MJNovio, SAzuaje, JPrieto-Díaz, RGioé, CAlispahic, BBrea, JLoza, MIFreire-Garabal, MGarcia-Santiago, CRodríguez-García, CGarcía-Mera, XCaamaño, OFernandez-Masaguer, CSardina, JFStefanachi, AEl Maatougui, AMallo-Abreu, AÅqvist, JGutiérrez-de-Terán, HSotelo, E 3,4-Dihydropyrimidin-2(1 J Med Chem64:458-480 (2021) 
 
Adenosine receptor A2a
Name:Adenosine receptor A2a
Type:G Protein-Coupled Receptor (GPCR)
Mol. Mass.:44716.46
Organism:Homo sapiens (Human)
Description:P29274
Residue:412
BDBM21173
NameBDBM21173
Synonyms:1,3-dipropyl-8-cyclopentylxanthine CHEMBL183 PD116948 | [3H]DPCPX
Typeradiolabeled ligand
Emp. Form.C16H24N4O2
Mol. Mass.304.3874
SMILESCCCn1c2nc([nH]c2c(=O)n(CCC)c1=O)C1CCCC1