Reaction Details
TargetPeptide deformylase, mitochondrial
LigandBDBM50131296
Substrate/Competitorn/a
Meas. Tech.ChEBML_154178
IC50 30±n/a nM
Citation Davies, SJAyscough, APBeckett, RPBragg, RAClements, JMDoel, SGrew, CLaunchbury, SBPerkins, GMPratt, LMSmith, HKSpavold, ZMThomas, SWTodd, RSWhittaker, M Structure-activity relationships of the peptide deformylase inhibitor BB-3497: modification of the methylene spacer and the P1' side chain. Bioorg Med Chem Lett13:2709-13 (2003) Peptide deformylase, mitochondrial
Name:Peptide deformylase, mitochondrial
Type:PROTEIN
Mol. Mass.:27023.25
Organism:Homo sapiens (Human)
Description:ChEMBL_154318
Residue:243
BDBM50131296
NameBDBM50131296
Synonyms:(R)-2-[(Formyl-hydroxy-amino)-methyl]-hex-4-ynoic acid ((S)-1-dimethylcarbamoyl-2,2-dimethyl-propyl)-amide | CHEMBL91461
TypeSmall organic molecule
Emp. Form.C16H27N3O4
Mol. Mass.325.4033
SMILESCC#CC[C@H](CN(O)C=O)C(=O)N[C@H](C(=O)N(C)C)C(C)(C)C