Reaction Details
TargetMatrix metalloproteinase-9
LigandBDBM50131661
Substrate/Competitorn/a
Meas. Tech.ChEMBL_105237 (CHEMBL712568)
IC50 0.800000±n/a nM
Citation Masuda, TNakayama, Y Development of a water-soluble matrix metalloproteinase inhibitor as an intra-arterial infusion drug for prevention of restenosis after angioplasty. J Med Chem46:3497-501 (2003) 
 
Matrix metalloproteinase-9
Name:Matrix metalloproteinase-9
Type:Enzyme
Mol. Mass.:78452.28
Organism:Homo sapiens (Human)
Description:P14780
Residue:707
BDBM50131661
NameBDBM50131661
Synonyms:CHEMBL116944 | N-(3-Hydroxycarbamoyl-1-hydroxymethyl-butyl)-4-phenoxy-benzamide
TypeSmall organic molecule
Emp. Form.C19H22N2O5
Mol. Mass.358.3884
SMILESC[C@@H](C[C@@H](CO)NC(=O)c1ccc(Oc2ccccc2)cc1)C(=O)NO