Reaction Details
Target72 kDa type IV collagenase
LigandBDBM50131660
Substrate/Competitorn/a
Meas. Tech.ChEMBL_104371 (CHEMBL715832)
IC50 1.1±n/a nM
Citation Masuda, TNakayama, Y Development of a water-soluble matrix metalloproteinase inhibitor as an intra-arterial infusion drug for prevention of restenosis after angioplasty. J Med Chem46:3497-501 (2003) 
 
72 kDa type IV collagenase
Name:72 kDa type IV collagenase
Type:Enzyme
Mol. Mass.:73870.36
Organism:Homo sapiens (Human)
Description: P08253
Residue:660
BDBM50131660
NameBDBM50131660
Synonyms:CHEMBL118497 | Succinic acid mono-[4-hydroxycarbamoyl-2-(4-phenoxy-benzoylamino)-pentyl] ester
TypeSmall organic molecule
Emp. Form.C23H26N2O8
Mol. Mass.458.4611
SMILESC[C@@H](C[C@@H](COC(=O)CCC(O)=O)NC(=O)c1ccc(Oc2ccccc2)cc1)C(=O)NO