Reaction Details
TargetAtypical chemokine receptor 3
LigandBDBM50264278
Substrate/Competitorn/a
Meas. Tech.ChEMBL_2102398 (CHEMBL4810794)
Ki 9.0±n/a nM
Citation Aspnes, GEMenhaji-Klotz, EBoehm, MLondregan, ATLee, ECYLimberakis, CCoffey, SBBrown, JAJones, RMHesp, KD Discovery and evaluation of non-basic small molecule modulators of the atypical chemokine receptor CXCR7. Bioorg Med Chem Lett50:0 (2021) 
 
Atypical chemokine receptor 3
Name:Atypical chemokine receptor 3
Type:Enzyme
Mol. Mass.:41498.84
Organism:Homo sapiens (Human)
Description:P25106
Residue:362
BDBM50264278
NameBDBM50264278
Synonyms:CHEMBL4064803
TypeSmall organic molecule
Emp. Form.C25H26N4OS
Mol. Mass.430.565
SMILESCOc1ccc2cccnc2c1N1CCCN(Cc2csc(n2)-c2ccccc2)CC1