Reaction Details
TargetAtypical chemokine receptor 3
LigandBDBM50264279
Substrate/Competitorn/a
Meas. Tech.ChEMBL_2102398 (CHEMBL4810794)
Ki 47±n/a nM
Citation Aspnes, GEMenhaji-Klotz, EBoehm, MLondregan, ATLee, ECYLimberakis, CCoffey, SBBrown, JAJones, RMHesp, KD Discovery and evaluation of non-basic small molecule modulators of the atypical chemokine receptor CXCR7. Bioorg Med Chem Lett50:0 (2021) 
 
Atypical chemokine receptor 3
Name:Atypical chemokine receptor 3
Type:Enzyme
Mol. Mass.:41498.84
Organism:Homo sapiens (Human)
Description:P25106
Residue:362
BDBM50264279
NameBDBM50264279
Synonyms:CHEMBL4072602
TypeSmall organic molecule
Emp. Form.C27H39N5O2
Mol. Mass.465.6309
SMILES[H][C@@]12CC[C@@]([H])(O1)[C@H](C2)C(=O)N1CCC(CN2CCCN(CC2)c2c(CC)ccn3ccnc23)CC1