Reaction Details
TargetAldehyde dehydrogenase family 1 member A3
LigandBDBM50459603
Substrate/Competitorn/a
Meas. Tech.ChEMBL_2103063 (CHEMBL4811566)
IC50 90±n/a nM
Citation Huddle, BCGrimley, EChtcherbinine, MBuchman, CDTakahashi, CDebnath, BMcGonigal, SCMao, SLi, SFelton, JPan, SWen, BSun, DNeamati, NBuckanovich, RJHurley, TDLarsen, SD Development of 2,5-dihydro-4H-pyrazolo[3,4-d]pyrimidin-4-one inhibitors of aldehyde dehydrogenase 1A (ALDH1A) as potential adjuncts to ovarian cancer chemotherapy. Eur J Med Chem211:0 (2021) 
 
Aldehyde dehydrogenase family 1 member A3
Name:Aldehyde dehydrogenase family 1 member A3
Type:PROTEIN
Mol. Mass.:56110.85
Organism:Homo sapiens (Human)
Description:ChEMBL_109700
Residue:512
BDBM50459603
NameBDBM50459603
Synonyms:CHEMBL4213331
TypeSmall organic molecule
Emp. Form.C19H15FN4OS
Mol. Mass.366.412
SMILESCn1ncc2c1nc(SCc1cccc(F)c1)n(-c1ccccc1)c2=O