Reaction Details
TargetAldehyde dehydrogenase family 1 member A3
LigandBDBM50567387
Substrate/Competitorn/a
Meas. Tech.ChEMBL_2103063 (CHEMBL4811566)
IC50 200±n/a nM
Citation Huddle, BCGrimley, EChtcherbinine, MBuchman, CDTakahashi, CDebnath, BMcGonigal, SCMao, SLi, SFelton, JPan, SWen, BSun, DNeamati, NBuckanovich, RJHurley, TDLarsen, SD Development of 2,5-dihydro-4H-pyrazolo[3,4-d]pyrimidin-4-one inhibitors of aldehyde dehydrogenase 1A (ALDH1A) as potential adjuncts to ovarian cancer chemotherapy. Eur J Med Chem211:0 (2021) 
 
Aldehyde dehydrogenase family 1 member A3
Name:Aldehyde dehydrogenase family 1 member A3
Type:PROTEIN
Mol. Mass.:56110.85
Organism:Homo sapiens (Human)
Description:ChEMBL_109700
Residue:512
BDBM50567387
NameBDBM50567387
Synonyms:CHEMBL4852411
TypeSmall organic molecule
Emp. Form.C21H17N5OS
Mol. Mass.387.458
SMILESCC(Sc1nc2n(C)ncc2c(=O)n1-c1ccc(cc1)C#N)c1ccccc1