Reaction Details
TargetAlpha-1D adrenergic receptor
LigandBDBM50131891
Substrate/Competitorn/a
Meas. Tech.ChEMBL_32455 (CHEMBL643403)
Ki 3.5±n/a nM
Citation Boschi, DTron, GCDi Stilo, AFruttero, RGasco, APoggesi, EMotta, GLeonardi, A New potential uroselective NO-donor alpha1-antagonists. J Med Chem46:3762-5 (2003) 
 
Alpha-1D adrenergic receptor
Name:Alpha-1D adrenergic receptor
Type:Enzyme Catalytic Domain
Mol. Mass.:60485.82
Organism:Homo sapiens (Human)
Description:adrenergic Alpha1D ADRA1D HUMAN::P25100
Residue:572
BDBM50131891
NameBDBM50131891
Synonyms:3-Methyl-4-oxo-2-phenyl-4H-chromene-8-carboxylic acid (3-{4-[2-(3-nitrooxy-propoxy)-phenyl]-piperazin-1-yl}-propyl)-amide | CHEMBL338029
TypeSmall organic molecule
Emp. Form.C33H36N4O7
Mol. Mass.600.6615
SMILESCc1c(oc2c(cccc2c1=O)C(=O)NCCCN1CCN(CC1)c1ccccc1OCCCO[N+]([O-])=O)-c1ccccc1