Reaction Details
TargetAlpha-1D adrenergic receptor
LigandBDBM50131889
Substrate/Competitorn/a
Meas. Tech.ChEMBL_32455 (CHEMBL643403)
Ki 4.2±n/a nM
Citation Boschi, DTron, GCDi Stilo, AFruttero, RGasco, APoggesi, EMotta, GLeonardi, A New potential uroselective NO-donor alpha1-antagonists. J Med Chem46:3762-5 (2003) 
 
Alpha-1D adrenergic receptor
Name:Alpha-1D adrenergic receptor
Type:Enzyme Catalytic Domain
Mol. Mass.:60485.82
Organism:Homo sapiens (Human)
Description:adrenergic Alpha1D ADRA1D HUMAN::P25100
Residue:572
BDBM50131889
NameBDBM50131889
Synonyms:3-Methyl-4-oxo-2-phenyl-4H-chromene-8-carboxylic acid (3-{4-[2-(4-methyl-5-oxy-furazan-3-ylmethoxy)-phenyl]-piperazin-1-yl}-propyl)-amide | CHEMBL338608
TypeSmall organic molecule
Emp. Form.C34H35N5O6
Mol. Mass.609.6716
SMILESCc1c(COc2ccccc2N2CCN(CCCNC(=O)c3cccc4c3oc(-c3ccccc3)c(C)c4=O)CC2)no[n+]1[O-]