Reaction Details
TargetAdenosine kinase
LigandBDBM50132280
Substrate/Competitorn/a
Meas. Tech.ChEMBL_31131 (CHEMBL643559)
IC50 2.8±n/a nM
Citation Zheng, GZMao, YLee, CHPratt, JKKoenig, JRPerner, RJCowart, MDGfesser, GAMcGaraughty, SChu, KLZhu, CYu, HKohlhaas, KAlexander, KMWismer, CTMikusa, JJarvis, MFKowaluk, EAStewart, AO Adenosine kinase inhibitors: polar 7-substitutent of pyridopyrimidine derivatives improving their locomotor selectivity. Bioorg Med Chem Lett13:3041-4 (2003) Adenosine kinase
Name:Adenosine kinase
Type:PROTEIN
Mol. Mass.:40545.97
Organism:Homo sapiens (Human)
Description:ChEMBL_1467841
Residue:362
BDBM50132280
NameBDBM50132280
Synonyms:5-(3-Bromo-phenyl)-7-{6-[4-(tetrahydro-pyran-4-yloxymethyl)-piperidin-1-yl]-pyridazin-3-yl}-pyrido[2,3-d]pyrimidin-4-ylamine | CHEMBL101805
TypeSmall organic molecule
Emp. Form.C28H30BrN7O2
Mol. Mass.576.488
SMILESNc1ncnc2nc(cc(-c3cccc(Br)c3)c12)-c1ccc(nn1)N1CCC(COC2CCOCC2)CC1