Reaction Details
TargetAdenosine kinase
LigandBDBM50132279
Substrate/Competitorn/a
Meas. Tech.ChEMBL_31131 (CHEMBL643559)
IC50 7.2±n/a nM
Citation Zheng, GZMao, YLee, CHPratt, JKKoenig, JRPerner, RJCowart, MDGfesser, GAMcGaraughty, SChu, KLZhu, CYu, HKohlhaas, KAlexander, KMWismer, CTMikusa, JJarvis, MFKowaluk, EAStewart, AO Adenosine kinase inhibitors: polar 7-substitutent of pyridopyrimidine derivatives improving their locomotor selectivity. Bioorg Med Chem Lett13:3041-4 (2003) Adenosine kinase
Name:Adenosine kinase
Type:PROTEIN
Mol. Mass.:40545.97
Organism:Homo sapiens (Human)
Description:ChEMBL_1467841
Residue:362
BDBM50132279
NameBDBM50132279
Synonyms:5-(3-Bromo-phenyl)-7-[6-(3,4-diethoxy-pyrrolidin-1-yl)-pyridazin-3-yl]-pyrido[2,3-d]pyrimidin-4-ylamine | CHEMBL102989
TypeSmall organic molecule
Emp. Form.C25H26BrN7O2
Mol. Mass.536.424
SMILESCCO[C@@H]1CN(C[C@@H]1OCC)c1ccc(nn1)-c1cc(-c2cccc(Br)c2)c2c(N)ncnc2n1