Reaction Details
TargetTyrosine-protein phosphatase non-receptor type 22
LigandBDBM50132459
Substrate/Competitorn/a
Meas. Tech.ChEBML_207577
Ki 273000±n/a nM
Citation Pei, ZLi, XLiu, GAbad-Zapatero, CLubben, TZhang, TBallaron, SJHutchins, CWTrevillyan, JMJirousek, MR Discovery and SAR of novel, potent and selective protein tyrosine phosphatase 1B inhibitors. Bioorg Med Chem Lett13:3129-32 (2003) Tyrosine-protein phosphatase non-receptor type 22
Name:Tyrosine-protein phosphatase non-receptor type 22
Type:n/a
Mol. Mass.:91712.31
Organism:Homo sapiens (Human)
Description:Q9Y2R2
Residue:807
BDBM50132459
NameBDBM50132459
Synonyms:5-{2-tert-Butoxycarbonylamino-2-[4-(2-methoxycarbonyl-3-hydroxy-phenoxy)-butylcarbamoyl]-ethyl}-2-(1-carboxy-ethoxy)-benzoic acid | CHEMBL106297
TypeSmall organic molecule
Emp. Form.C30H38N2O12
Mol. Mass.618.6289
SMILESCOC(=O)c1c(O)cccc1OCCCCNC(=O)[C@H](Cc1ccc(OC(C)C(O)=O)c(c1)C(O)=O)NC(=O)OC(C)(C)C