Reaction Details
TargetTyrosine-protein phosphatase non-receptor type 22
LigandBDBM50132460
Substrate/Competitorn/a
Meas. Tech.ChEBML_207577
Ki 9000±n/a nM
Citation Pei, ZLi, XLiu, GAbad-Zapatero, CLubben, TZhang, TBallaron, SJHutchins, CWTrevillyan, JMJirousek, MR Discovery and SAR of novel, potent and selective protein tyrosine phosphatase 1B inhibitors. Bioorg Med Chem Lett13:3129-32 (2003) Tyrosine-protein phosphatase non-receptor type 22
Name:Tyrosine-protein phosphatase non-receptor type 22
Type:n/a
Mol. Mass.:91712.31
Organism:Homo sapiens (Human)
Description:Q9Y2R2
Residue:807
BDBM50132460
NameBDBM50132460
Synonyms:2-[4-((S)-2-tert-Butoxycarbonylamino-3-{4-[(2-carboxy-butyl)-oxalyl-amino]-phenyl}-propionylamino)-butoxy]-6-hydroxy-benzoic acid methyl ester | CHEMBL106993
TypeSmall organic molecule
Emp. Form.C33H43N3O12
Mol. Mass.673.7074
SMILESCCC(CN(C(=O)C(O)=O)c1ccc(C[C@H](NC(=O)OC(C)(C)C)C(=O)NCCCCOc2cccc(O)c2C(=O)OC)cc1)C(O)=O