Reaction Details
TargetReceptor-type tyrosine-protein phosphatase F
LigandBDBM50132465
Substrate/Competitorn/a
Meas. Tech.ChEBML_97145
Ki>30000±n/a nM
Citation Pei, ZLi, XLiu, GAbad-Zapatero, CLubben, TZhang, TBallaron, SJHutchins, CWTrevillyan, JMJirousek, MR Discovery and SAR of novel, potent and selective protein tyrosine phosphatase 1B inhibitors. Bioorg Med Chem Lett13:3129-32 (2003) Receptor-type tyrosine-protein phosphatase F
Name:Receptor-type tyrosine-protein phosphatase F
Type:Protein
Mol. Mass.:212869.85
Organism:Homo sapiens (Human)
Description:P10586
Residue:1907
BDBM50132465
NameBDBM50132465
Synonyms:5-{(S)-2-((S)-2-tert-Butoxycarbonylamino-3-phenyl-propionylamino)-2-[4-(2-methoxycarbonyl-3-hydroxy-phenoxy)-butylcarbamoyl]-ethyl}-2-(1-carboxy-ethoxy)-benzoic acid | CHEMBL107729
TypeSmall organic molecule
Emp. Form.C39H47N3O13
Mol. Mass.765.8028
SMILESCOC(=O)c1c(O)cccc1OCCCCNC(=O)[C@H](Cc1ccc(OC(C)C(O)=O)c(c1)C(O)=O)NC(=O)[C@H](Cc1ccccc1)NC(=O)OC(C)(C)C