Reaction Details
TargetDelta-type opioid receptor
LigandBDBM50132643
Substrate/Competitorn/a
Meas. Tech.ChEBML_145469
Ki 8779±n/a nM
Citation Chen, ZMiller, WSShan, SValenzano, KJ Design and parallel synthesis of piperidine libraries targeting the nociceptin (N/OFQ) receptor. Bioorg Med Chem Lett13:3247-52 (2003) Delta-type opioid receptor
Name:Delta-type opioid receptor
Type:G Protein-Coupled Receptor (GPCR)
Mol. Mass.:40382.98
Organism:Homo sapiens (Human)
Description:Competition binding assays were carried out using membrane preparations from transfected HN9.10 cells that constitutively expressed the delta opioid receptor.
Residue:372
BDBM50132643
NameBDBM50132643
Synonyms:4-(4-Chloro-3-trifluoromethyl-phenyl)-1-cyclooctylmethyl-piperidin-4-ol | CHEMBL109598
TypeSmall organic molecule
Emp. Form.C21H29ClF3NO
Mol. Mass.403.909
SMILESOC1(CCN(CC2CCCCCCC2)CC1)c1ccc(Cl)c(c1)C(F)(F)F