Reaction Details
TargetNociceptin receptor
LigandBDBM50132642
Substrate/Competitorn/a
Meas. Tech.ChEMBL_148271 (CHEMBL750188)
Ki 135±n/a nM
Citation Chen, ZMiller, WSShan, SValenzano, KJ Design and parallel synthesis of piperidine libraries targeting the nociceptin (N/OFQ) receptor. Bioorg Med Chem Lett13:3247-52 (2003) Nociceptin receptor
Name:Nociceptin receptor
Type:G Protein-Coupled Receptor (GPCR)
Mol. Mass.:40702.87
Organism:Homo sapiens (Human)
Description:P41146
Residue:370
BDBM50132642
NameBDBM50132642
Synonyms:1-(4-Propyl-cyclohexyl)-4-(3-trifluoromethyl-phenyl)-piperidin-4-ol | CHEMBL109563
TypeSmall organic molecule
Emp. Form.C21H30F3NO
Mol. Mass.369.4642
SMILESCCCC1CCC(CC1)N1CCC(O)(CC1)c1cccc(c1)C(F)(F)F