Reaction Details
TargetNociceptin receptor
LigandBDBM50132647
Substrate/Competitorn/a
Meas. Tech.ChEMBL_148271 (CHEMBL750188)
Ki 116±n/a nM
Citation Chen, ZMiller, WSShan, SValenzano, KJ Design and parallel synthesis of piperidine libraries targeting the nociceptin (N/OFQ) receptor. Bioorg Med Chem Lett13:3247-52 (2003) Nociceptin receptor
Name:Nociceptin receptor
Type:G Protein-Coupled Receptor (GPCR)
Mol. Mass.:40702.87
Organism:Homo sapiens (Human)
Description:P41146
Residue:370
BDBM50132647
NameBDBM50132647
Synonyms:1-(3,3-Diphenyl-propyl)-4-(3-trifluoromethyl-phenyl)-piperidin-4-ol | CHEMBL322515
TypeSmall organic molecule
Emp. Form.C27H28F3NO
Mol. Mass.439.5125
SMILESOC1(CCN(CCC(c2ccccc2)c2ccccc2)CC1)c1cccc(c1)C(F)(F)F