Reaction Details
TargetNociceptin receptor
LigandBDBM50132654
Substrate/Competitorn/a
Meas. Tech.ChEBML_148272
Ki 153±n/a nM
Citation Chen, ZMiller, WSShan, SValenzano, KJ Design and parallel synthesis of piperidine libraries targeting the nociceptin (N/OFQ) receptor. Bioorg Med Chem Lett13:3247-52 (2003) Nociceptin receptor
Name:Nociceptin receptor
Type:G Protein-Coupled Receptor (GPCR)
Mol. Mass.:40702.87
Organism:Homo sapiens (Human)
Description:P41146
Residue:370
BDBM50132654
NameBDBM50132654
Synonyms:4-(4-Chloro-phenyl)-1-naphthalen-2-ylmethyl-piperidin-4-ol | CHEMBL326030
TypeSmall organic molecule
Emp. Form.C22H22ClNO
Mol. Mass.351.869
SMILESOC1(CCN(Cc2ccc3ccccc3c2)CC1)c1ccc(Cl)cc1