Reaction Details
TargetNociceptin receptor
LigandBDBM50132653
Substrate/Competitorn/a
Meas. Tech.ChEBML_148272
Ki>10000±n/a nM
Citation Chen, ZMiller, WSShan, SValenzano, KJ Design and parallel synthesis of piperidine libraries targeting the nociceptin (N/OFQ) receptor. Bioorg Med Chem Lett13:3247-52 (2003) Nociceptin receptor
Name:Nociceptin receptor
Type:G Protein-Coupled Receptor (GPCR)
Mol. Mass.:40702.87
Organism:Homo sapiens (Human)
Description:P41146
Residue:370
BDBM50132653
NameBDBM50132653
Synonyms:4-[4-(4-Chloro-3-trifluoromethyl-phenyl)-4-hydroxy-piperidin-1-ylmethyl]-benzonitrile | CHEMBL321685
TypeSmall organic molecule
Emp. Form.C20H18ClF3N2O
Mol. Mass.394.818
SMILESOC1(CCN(Cc2ccc(cc2)C#N)CC1)c1ccc(Cl)c(c1)C(F)(F)F