Reaction Details
TargetNociceptin receptor
LigandBDBM50132657
Substrate/Competitorn/a
Meas. Tech.ChEBML_148272
Ki>10000±n/a nM
Citation Chen, ZMiller, WSShan, SValenzano, KJ Design and parallel synthesis of piperidine libraries targeting the nociceptin (N/OFQ) receptor. Bioorg Med Chem Lett13:3247-52 (2003) Nociceptin receptor
Name:Nociceptin receptor
Type:G Protein-Coupled Receptor (GPCR)
Mol. Mass.:40702.87
Organism:Homo sapiens (Human)
Description:P41146
Residue:370
BDBM50132657
NameBDBM50132657
Synonyms:4-(4-Chloro-3-trifluoromethyl-phenyl)-1-(5-nitro-furan-2-ylmethyl)-piperidin-4-ol | CHEMBL109223
TypeSmall organic molecule
Emp. Form.C17H16ClF3N2O4
Mol. Mass.404.768
SMILESOC1(CCN(Cc2ccc(o2)[N+]([O-])=O)CC1)c1ccc(Cl)c(c1)C(F)(F)F