Reaction Details
TargetKappa-type opioid receptor
LigandBDBM50132643
Substrate/Competitorn/a
Meas. Tech.ChEBML_145236
Ki 1653±n/a nM
Citation Chen, ZMiller, WSShan, SValenzano, KJ Design and parallel synthesis of piperidine libraries targeting the nociceptin (N/OFQ) receptor. Bioorg Med Chem Lett13:3247-52 (2003) Kappa-type opioid receptor
Name:Kappa-type opioid receptor
Type:G Protein-Coupled Receptor (GPCR)
Mol. Mass.:42648.76
Organism:Homo sapiens (Human)
Description:P41145
Residue:380
BDBM50132643
NameBDBM50132643
Synonyms:4-(4-Chloro-3-trifluoromethyl-phenyl)-1-cyclooctylmethyl-piperidin-4-ol | CHEMBL109598
TypeSmall organic molecule
Emp. Form.C21H29ClF3NO
Mol. Mass.403.909
SMILESOC1(CCN(CC2CCCCCCC2)CC1)c1ccc(Cl)c(c1)C(F)(F)F