Reaction Details
TargetNociceptin receptor
LigandBDBM50132661
Substrate/Competitorn/a
Meas. Tech.ChEBML_148272
Ki>10000±n/a nM
Citation Chen, ZMiller, WSShan, SValenzano, KJ Design and parallel synthesis of piperidine libraries targeting the nociceptin (N/OFQ) receptor. Bioorg Med Chem Lett13:3247-52 (2003) Nociceptin receptor
Name:Nociceptin receptor
Type:G Protein-Coupled Receptor (GPCR)
Mol. Mass.:40702.87
Organism:Homo sapiens (Human)
Description:P41146
Residue:370
BDBM50132661
NameBDBM50132661
Synonyms:1-(2-Methyl-naphthalen-1-ylmethyl)-4-phenyl-piperidine-4-carbonitrile | CHEMBL320342
TypeSmall organic molecule
Emp. Form.C24H24N2
Mol. Mass.340.4608
SMILESCc1ccc2ccccc2c1CN1CCC(CC1)(C#N)c1ccccc1