Reaction Details
TargetMu-type opioid receptor
LigandBDBM50132644
Substrate/Competitorn/a
Meas. Tech.ChEBML_149491
Ki 4±n/a nM
Citation Chen, ZMiller, WSShan, SValenzano, KJ Design and parallel synthesis of piperidine libraries targeting the nociceptin (N/OFQ) receptor. Bioorg Med Chem Lett13:3247-52 (2003) Mu-type opioid receptor
Name:Mu-type opioid receptor
Type:G Protein-Coupled Receptor (GPCR)
Mol. Mass.:44789.51
Organism:Homo sapiens (Human)
Description:P35372
Residue:400
BDBM50132644
NameBDBM50132644
Synonyms:4-(4-Chloro-3-trifluoromethyl-phenyl)-1-(3,3-diphenyl-propyl)-piperidin-4-ol | CHEMBL325536
TypeSmall organic molecule
Emp. Form.C27H27ClF3NO
Mol. Mass.473.958
SMILESOC1(CCN(CCC(c2ccccc2)c2ccccc2)CC1)c1ccc(Cl)c(c1)C(F)(F)F