Reaction Details
TargetNociceptin receptor
LigandBDBM50132663
Substrate/Competitorn/a
Meas. Tech.ChEBML_148272
Ki 827.0±n/a nM
Citation Chen, ZMiller, WSShan, SValenzano, KJ Design and parallel synthesis of piperidine libraries targeting the nociceptin (N/OFQ) receptor. Bioorg Med Chem Lett13:3247-52 (2003) Nociceptin receptor
Name:Nociceptin receptor
Type:G Protein-Coupled Receptor (GPCR)
Mol. Mass.:40702.87
Organism:Homo sapiens (Human)
Description:P41146
Residue:370
BDBM50132663
NameBDBM50132663
Synonyms:1-Naphthalen-1-ylmethyl-4-phenyl-piperidine-4-carbonitrile | CHEMBL325774
TypeSmall organic molecule
Emp. Form.C23H22N2
Mol. Mass.326.4342
SMILESN#CC1(CCN(Cc2cccc3ccccc23)CC1)c1ccccc1