Reaction Details
TargetRetinoic acid receptor RXR-alpha
LigandBDBM50133126
Substrate/Competitorn/a
Meas. Tech.ChEMBL_196897 (CHEMBL807181)
Ki 1.9±n/a nM
Citation Michellys, PYArdecky, RJChen, JHD'Arrigo, JGrese, TAKaranewsky, DSLeibowitz, MDLiu, SMais, DAMapes, CMMontrose-Rafizadeh, COgilvie, KMReifel-Miller, ARungta, DThompson, AWTyhonas, JSBoehm, MF Design, synthesis, and structure-activity relationship studies of novel 6,7-locked-[7-(2-alkoxy-3,5-dialkylbenzene)-3-methylocta]-2,4,6-trienoic acids. J Med Chem46:4087-103 (2003) 
 
Retinoic acid receptor RXR-alpha
Name:Retinoic acid receptor RXR-alpha
Type:Enzyme Catalytic Domain
Mol. Mass.:51273.78
Organism:RAT
Description:NR2B Channel Blocker 0 RAT::Q05343
Residue:467
BDBM50133126
NameBDBM50133126
Synonyms:5-[2-(3,5-Diisopropyl-2-propoxy-phenyl)-cyclopent-1-enyl]-3-methyl-penta-2,4-dienoic acid | CHEMBL133176
TypeSmall organic molecule
Emp. Form.C26H36O3
Mol. Mass.396.5622
SMILESCCCOc1c(cc(cc1C1=C(CCC1)\C=C\C(\C)=C\C(O)=O)C(C)C)C(C)C