Reaction Details
TargetRetinoic acid receptor, gamma
LigandBDBM50129720
Substrate/Competitorn/a
Meas. Tech.ChEMBL_196168 (CHEMBL804941)
Ki>1000±n/a nM
Citation Michellys, PYArdecky, RJChen, JHD'Arrigo, JGrese, TAKaranewsky, DSLeibowitz, MDLiu, SMais, DAMapes, CMMontrose-Rafizadeh, COgilvie, KMReifel-Miller, ARungta, DThompson, AWTyhonas, JSBoehm, MF Design, synthesis, and structure-activity relationship studies of novel 6,7-locked-[7-(2-alkoxy-3,5-dialkylbenzene)-3-methylocta]-2,4,6-trienoic acids. J Med Chem46:4087-103 (2003) 
 
Retinoic acid receptor, gamma
Name:Retinoic acid receptor, gamma
Synonyms:Retinoic acid receptor gamma
Type:PROTEIN
Mol. Mass.:53686.83
Organism:Rattus norvegicus
Description:ChEMBL_196168
Residue:485
BDBM50129720
NameBDBM50129720
TypeSmall organic molecule
Emp. Form.C25H34F2O3
Mol. Mass.420.5325
SMILESC\C(\C=C\C=C(\C)c1cc(cc(c1OCC(F)F)C(C)(C)C)C(C)(C)C)=C/C(O)=O