Reaction Details
TargetRetinoic acid receptor RXR-beta
LigandBDBM50133121
Substrate/Competitorn/a
Meas. Tech.ChEMBL_197072 (CHEMBL872603)
Ki 5.2±n/a nM
Citation Michellys, PYArdecky, RJChen, JHD'Arrigo, JGrese, TAKaranewsky, DSLeibowitz, MDLiu, SMais, DAMapes, CMMontrose-Rafizadeh, COgilvie, KMReifel-Miller, ARungta, DThompson, AWTyhonas, JSBoehm, MF Design, synthesis, and structure-activity relationship studies of novel 6,7-locked-[7-(2-alkoxy-3,5-dialkylbenzene)-3-methylocta]-2,4,6-trienoic acids. J Med Chem46:4087-103 (2003) 
 
Retinoic acid receptor RXR-beta
Name:Retinoic acid receptor RXR-beta
Type:PROTEIN
Mol. Mass.:49084.47
Organism:Rattus norvegicus
Description:ChEMBL_197072
Residue:458
BDBM50133121
NameBDBM50133121
Synonyms:5-{3-[3-tert-Butyl-2-(2,2-difluoro-ethoxy)-5-ethyl-phenyl]-thiophen-2-yl}-3-methyl-penta-2,4-dienoic acid | CHEMBL129887
TypeSmall organic molecule
Emp. Form.C24H28F2O3S
Mol. Mass.434.539
SMILESCCc1cc(-c2ccsc2\C=C\C(\C)=C\C(O)=O)c(OCC(F)F)c(c1)C(C)(C)C