Reaction Details
TargetLysine-specific histone demethylase 2
LigandBDBM50568528
Substrate/Competitorn/a
Meas. Tech.ChEMBL_2105768 (CHEMBL4814443)
IC50 6800±n/a nM
Citation Dai, XJLiu, YXiong, XPXue, LPZheng, YCLiu, HM Tranylcypromine Based Lysine-Specific Demethylase 1 Inhibitor: Summary and Perspective. J Med Chem63:14197-14215 (2020) 
 
Lysine-specific histone demethylase 2
Name:Lysine-specific histone demethylase 2
Type:PROTEIN
Mol. Mass.:92112.91
Organism:Homo sapiens (Human)
Description:ChEMBL_992590
Residue:822
BDBM50568528
NameBDBM50568528
Synonyms:CHEMBL4872682
TypeSmall organic molecule
Emp. Form.C19H20BrNO
Mol. Mass.358.272
SMILESCOc1ccc(Br)cc1CNC1CC11CCc2ccccc12