Reaction Details
TargetLysine-specific histone demethylase 2
LigandBDBM50568530
Substrate/Competitorn/a
Meas. Tech.ChEMBL_2105768 (CHEMBL4814443)
IC50 1600±n/a nM
Citation Dai, XJLiu, YXiong, XPXue, LPZheng, YCLiu, HM Tranylcypromine Based Lysine-Specific Demethylase 1 Inhibitor: Summary and Perspective. J Med Chem63:14197-14215 (2020) 
 
Lysine-specific histone demethylase 2
Name:Lysine-specific histone demethylase 2
Type:PROTEIN
Mol. Mass.:92112.91
Organism:Homo sapiens (Human)
Description:ChEMBL_992590
Residue:822
BDBM50568530
NameBDBM50568530
Synonyms:CHEMBL4857247
TypeSmall organic molecule
Emp. Form.C20H22ClNO2
Mol. Mass.343.847
SMILESCOc1ccc(CNC2CC22CCc3ccccc23)c(Cl)c1OC