Reaction Details
TargetTyrosine-protein kinase Lck
LigandBDBM50133496
Substrate/Competitorn/a
Meas. Tech.ChEMBL_221512 (CHEMBL841495)
IC50 24000±n/a nM
Citation Park, SHKang, SHLim, SHOh, HSLee, KH Design and synthesis of small chemical inhibitors containing different scaffolds for lck SH2 domain. Bioorg Med Chem Lett13:3455-9 (2003) Tyrosine-protein kinase Lck
Name:Tyrosine-protein kinase Lck
Type:n/a
Mol. Mass.:57987.83
Organism:Homo sapiens (Human)
Description:P06239
Residue:509
BDBM50133496
NameBDBM50133496
Synonyms:(2R)-3-(3,4-dihydroxyphenyl)-2-[(2E)-3-(3,4-dihydroxyphenyl)prop-2-enoyloxy]propanoic acid CHEMBL324842 US10688093, Compound rosmarinic acid cid_5281792
TypeSmall organic molecule
Emp. Form.C18H16O8
Mol. Mass.360.3148
SMILESOC(=O)[C@@H](Cc1ccc(O)c(O)c1)OC(=O)\C=C\c1ccc(O)c(O)c1