Reaction Details
TargetNeuropeptide Y receptor type 5
LigandBDBM50133759
Substrate/Competitorn/a
Meas. Tech.ChEBML_144129
Ki 40±n/a nM
Citation Elliott, RLOliver, RMLaFlamme, JAGillaspy, MLHammond, MHank, RFMaurer, TSBaker, DLDaSilva-Jardine, PAStevenson, RWMack, CMCassella, JV Structure-activity relationship studies on 2-heteroaryl-4-arylimidazoles NPY5 receptor antagonists. Bioorg Med Chem Lett13:3593-6 (2003) Neuropeptide Y receptor type 5
Name:Neuropeptide Y receptor type 5
Type:Enzyme
Mol. Mass.:50746.64
Organism:Homo sapiens (Human)
Description:Q15761
Residue:445
BDBM50133759
NameBDBM50133759
Synonyms:3-(5-o-Tolyl-1H-imidazol-2-yl)-pyridine | CHEMBL332582
TypeSmall organic molecule
Emp. Form.C15H13N3
Mol. Mass.235.2838
SMILESCc1ccccc1-c1c[nH]c(n1)-c1cccnc1