Reaction Details
TargetNeuropeptide Y receptor type 5
LigandBDBM50133766
Substrate/Competitorn/a
Meas. Tech.ChEBML_144129
Ki 34±n/a nM
Citation Elliott, RLOliver, RMLaFlamme, JAGillaspy, MLHammond, MHank, RFMaurer, TSBaker, DLDaSilva-Jardine, PAStevenson, RWMack, CMCassella, JV Structure-activity relationship studies on 2-heteroaryl-4-arylimidazoles NPY5 receptor antagonists. Bioorg Med Chem Lett13:3593-6 (2003) Neuropeptide Y receptor type 5
Name:Neuropeptide Y receptor type 5
Type:Enzyme
Mol. Mass.:50746.64
Organism:Homo sapiens (Human)
Description:Q15761
Residue:445
BDBM50133766
NameBDBM50133766
Synonyms:3-[5-(3,4-Difluoro-phenyl)-1H-imidazol-2-yl]-pyridine | CHEMBL120431
TypeSmall organic molecule
Emp. Form.C14H9F2N3
Mol. Mass.257.2382
SMILESFc1ccc(cc1F)-c1c[nH]c(n1)-c1cccnc1