Reaction Details
TargetcGMP-specific 3',5'-cyclic phosphodiesterase
LigandBDBM50134126
Substrate/Competitorn/a
Meas. Tech.ChEMBL_155186 (CHEMBL761833)
IC50 17±n/a nM
Citation Daugan, AGrondin, PRuault, CLe Monnier de Gouville, ACCoste, HLinget, JMKirilovsky, JHyafil, FLabaudinière, R The discovery of tadalafil: a novel and highly selective PDE5 inhibitor. 2: 2,3,6,7,12,12a-hexahydropyrazino[1',2':1,6]pyrido[3,4-b]indole-1,4-dione analogues. J Med Chem46:4533-42 (2003) 
 
cGMP-specific 3',5'-cyclic phosphodiesterase
Name:cGMP-specific 3',5'-cyclic phosphodiesterase
Type:PROTEIN
Mol. Mass.:98615.45
Organism:Bos taurus
Description:ChEMBL_155186
Residue:865
BDBM50134126
NameBDBM50134126
Synonyms:(5R,6R)-2-Cyclopropyl-6-(4-methoxy-phenyl)-2,3,6,7,12,12a-hexahydro-pyrazino[1',2':1,6]pyrido[3,4-b]indole-1,4-dione | CHEMBL141703
TypeSmall organic molecule
Emp. Form.C26H27N3O3
Mol. Mass.429.5109
SMILESCOc1ccc(cc1)[C@H]1N2[C@H](Cc3c1[nH]c1ccccc31)C(=O)N(CC2=O)C1CCCC1