Reaction Details
TargetcGMP-specific 3',5'-cyclic phosphodiesterase
LigandBDBM50134140
Substrate/Competitorn/a
Meas. Tech.ChEMBL_155186 (CHEMBL761833)
IC50 41±n/a nM
Citation Daugan, AGrondin, PRuault, CLe Monnier de Gouville, ACCoste, HLinget, JMKirilovsky, JHyafil, FLabaudinière, R The discovery of tadalafil: a novel and highly selective PDE5 inhibitor. 2: 2,3,6,7,12,12a-hexahydropyrazino[1',2':1,6]pyrido[3,4-b]indole-1,4-dione analogues. J Med Chem46:4533-42 (2003) 
 
cGMP-specific 3',5'-cyclic phosphodiesterase
Name:cGMP-specific 3',5'-cyclic phosphodiesterase
Type:PROTEIN
Mol. Mass.:98615.45
Organism:Bos taurus
Description:ChEMBL_155186
Residue:865
BDBM50134140
NameBDBM50134140
Synonyms:(5R,6R)-6-(4-Methoxy-phenyl)-2-methyl-2,3,6,7,12,12a-hexahydro-pyrazino[1',2':1,6]pyrido[3,4-b]indole-1,4-dione | CHEMBL334684
TypeSmall organic molecule
Emp. Form.C22H21N3O3
Mol. Mass.375.4204
SMILESCOc1ccc(cc1)[C@H]1N2[C@H](Cc3c1[nH]c1ccccc31)C(=O)N(C)CC2=O