Reaction Details
Target3-oxoacyl-[acyl-carrier-protein] synthase 3
LigandBDBM50134355
Substrate/Competitorn/a
Meas. Tech.ChEBML_37595
IC50 43000±n/a nM
Citation Senior, SJIllarionov, PAGurcha, SSCampbell, IBSchaeffer, MLMinnikin, DEBesra, GS Biphenyl-based analogues of thiolactomycin, active against Mycobacterium tuberculosis mtFabH fatty acid condensing enzyme. Bioorg Med Chem Lett13:3685-8 (2003) 3-oxoacyl-[acyl-carrier-protein] synthase 3
Name:3-oxoacyl-[acyl-carrier-protein] synthase 3
Type:Enzyme
Mol. Mass.:34865.07
Organism:Mycobacterium tuberculosis
Description:P9WNG3
Residue:335
BDBM50134355
NameBDBM50134355
Synonyms:5-(4-tert-Butyl-benzyl)-4-hydroxy-3,5-dimethyl-5H-thiophen-2-one CHEMBL333571
TypeSmall organic molecule
Emp. Form.C17H22O2S
Mol. Mass.290.42
SMILESCC1C(=O)SC(C)(Cc2ccc(cc2)C(C)(C)C)C1=O