Reaction Details
TargetCoagulation factor X
LigandBDBM50134405
Substrate/Competitorn/a
Meas. Tech.ChEBML_48980
IC50>30000±n/a nM
Citation Parlow, JJKurumbail, RGStegeman, RAStevens, AMStallings, WCSouth, MS Synthesis and X-ray crystal structures of substituted fluorobenzene and benzoquinone inhibitors of the tissue factor VIIa complex. Bioorg Med Chem Lett13:3721-5 (2003) Coagulation factor X
Name:Coagulation factor X
Type:Enzyme
Mol. Mass.:54726.60
Organism:Homo sapiens (Human)
Description:n/a
Residue:488
BDBM50134405
NameBDBM50134405
Synonyms:CHEMBL421098 | N-(4-Carbamimidoyl-benzyl)-2-(5-isopropylamino-3,6-dioxo-2-phenyl-cyclohexa-1,4-dienyl)-acetamide
TypeSmall organic molecule
Emp. Form.C25H26N4O3
Mol. Mass.430.4989
SMILES[#6]\[#6](-[#6])=[#7]/c1cc(-[#8])c(-c2ccccc2)c(-[#6]-[#6](=O)-[#7]-[#6]-c2ccc(cc2)-[#6](-[#7])=[#7])c1-[#8]