Reaction Details
TargetProthrombin
LigandBDBM14601
Substrate/Competitorn/a
Meas. Tech.ChEBML_208870
IC50>30000±n/a nM
Citation Parlow, JJKurumbail, RGStegeman, RAStevens, AMStallings, WCSouth, MS Synthesis and X-ray crystal structures of substituted fluorobenzene and benzoquinone inhibitors of the tissue factor VIIa complex. Bioorg Med Chem Lett13:3721-5 (2003) Prothrombin
Name:Prothrombin
Type:Protein
Mol. Mass.:70029.57
Organism:Homo sapiens (Human)
Description:P00734
Residue:622
BDBM14601
NameBDBM14601
Synonyms:CHEMBL125585 N-{4-[Amino(imino)methyl]benzyl}-2-[3-hydroxy-4-(isopropyl)-1,1-biphenyl-2-yl]acetamide | Substituted Benzene Analog 53
TypeSmall organic molecule
Emp. Form.C25H28N4O2
Mol. Mass.416.5154
SMILESCC(C)Nc1ccc(-c2ccccc2)c(CC(=O)NCc2ccc(cc2)C(N)=N)c1O