Reaction Details
TargetProstaglandin E2 receptor EP1 subtype
LigandBDBM50117689
Substrate/Competitorn/a
Meas. Tech.ChEBML_158175
Ki 8100±n/a nM
Citation Gallant, MBelley, MCarrière, MCChateauneuf, ADenis, DLachance, NLamontagne, SMetters, KMSawyer, NSlipetz, DTruchon, JFLabelle, M Structure-activity relationship of triaryl propionic acid analogues on the human EP3 prostanoid receptor. Bioorg Med Chem Lett13:3813-6 (2003) Prostaglandin E2 receptor EP1 subtype
Name:Prostaglandin E2 receptor EP1 subtype
Type:Enzyme
Mol. Mass.:41834.57
Organism:Homo sapiens (Human)
Description:P34995
Residue:402
BDBM50117689
NameBDBM50117689
Synonyms:CHEMBL87371 | Thiophene-2-sulfonic acid [(E)-3-(3',4'-dichloro-biphenyl-2-yl)-acryloyl]-amide
TypeSmall organic molecule
Emp. Form.C19H13Cl2NO3S2
Mol. Mass.438.347
SMILESClc1ccc(cc1Cl)-c1ccccc1\C=C\C(=O)NS(=O)(=O)c1cccs1