Reaction Details
TargetProstaglandin E2 receptor EP3 subtype
LigandBDBM50134519
Substrate/Competitorn/a
Meas. Tech.ChEBML_158318
Ki 23±n/a nM
Citation Gallant, MBelley, MCarrière, MCChateauneuf, ADenis, DLachance, NLamontagne, SMetters, KMSawyer, NSlipetz, DTruchon, JFLabelle, M Structure-activity relationship of triaryl propionic acid analogues on the human EP3 prostanoid receptor. Bioorg Med Chem Lett13:3813-6 (2003) Prostaglandin E2 receptor EP3 subtype
Name:Prostaglandin E2 receptor EP3 subtype
Type:Enzyme
Mol. Mass.:43335.03
Organism:Homo sapiens (Human)
Description:P43115
Residue:390
BDBM50134519
NameBDBM50134519
Synonyms:3-{2-[5-(2-Benzyloxy-phenyl)-thiophen-3-yl]-phenyl}-propionic acid | CHEMBL124738
TypeSmall organic molecule
Emp. Form.C26H22O3S
Mol. Mass.414.516
SMILESOC(=O)CCc1ccccc1-c1csc(c1)-c1ccccc1OCc1ccccc1