Reaction Details
TargetProstaglandin E2 receptor EP3 subtype
LigandBDBM50134514
Substrate/Competitorn/a
Meas. Tech.ChEBML_158318
Ki 89±n/a nM
Citation Gallant, MBelley, MCarrière, MCChateauneuf, ADenis, DLachance, NLamontagne, SMetters, KMSawyer, NSlipetz, DTruchon, JFLabelle, M Structure-activity relationship of triaryl propionic acid analogues on the human EP3 prostanoid receptor. Bioorg Med Chem Lett13:3813-6 (2003) Prostaglandin E2 receptor EP3 subtype
Name:Prostaglandin E2 receptor EP3 subtype
Type:Enzyme
Mol. Mass.:43335.03
Organism:Homo sapiens (Human)
Description:P43115
Residue:390
BDBM50134514
NameBDBM50134514
Synonyms:3-(2-Phenoxymethyl-[1,1';3',1'']terphenyl-2''-yl)-propionic acid | CHEMBL127482
TypeSmall organic molecule
Emp. Form.C28H24O3
Mol. Mass.408.4884
SMILESOC(=O)CCc1ccccc1-c1cccc(c1)-c1ccccc1COc1ccccc1