Reaction Details
TargetCycloartenol-C-24-methyltransferase
LigandBDBM50134728
Substrate/Competitorn/a
Meas. Tech.ChEMBL_203192 (CHEMBL804437)
IC50>100000±n/a nM
Citation Magaraci, FJimenez, CJRodrigues, CRodrigues, JCBraga, MVYardley, Vde Luca-Fradley, KCroft, SLde Souza, WRuiz-Perez, LMUrbina, JGonzalez Pacanowska, DGilbert, IH Azasterols as inhibitors of sterol 24-methyltransferase in Leishmania species and Trypanosoma cruzi. J Med Chem46:4714-27 (2003) 
 
Cycloartenol-C-24-methyltransferase
Name:Cycloartenol-C-24-methyltransferase
Type:PROTEIN
Mol. Mass.:38266.01
Organism:Arabidopsis thaliana
Description:ChEMBL_415082
Residue:336
BDBM50134728
NameBDBM50134728
Synonyms:(3S,10S,13S,17S)-17-[1-(3-Chloro-pyridin-4-yl)-1-hydroxy-ethyl]-10,13-dimethyl-hexadecahydro-cyclopenta[a]phenanthren-3-ol | CHEMBL359216
TypeSmall organic molecule
Emp. Form.C26H38ClNO2
Mol. Mass.432.038
SMILESCC(O)([C@H]1CCC2C3CCC4C[C@@H](O)CC[C@]4(C)C3CC[C@]12C)c1ccncc1Cl