Reaction Details
TargetPeroxisome proliferator-activated receptor gamma
LigandBDBM50109546
Substrate/Competitorn/a
Meas. Tech.ChEMBL_154197 (CHEMBL760004)
EC50 7910±n/a nM
Citation Sauerberg, PBury, PSMogensen, JPDeussen, HJPettersson, IFleckner, JNehlin, JFrederiksen, KSAlbrektsen, TDin, NSvensson, LAYnddal, LWulff, EMJeppesen, L Large dimeric ligands with favorable pharmacokinetic properties and peroxisome proliferator-activated receptor agonist activity in vitro and in vivo. J Med Chem46:4883-94 (2003) 
 
Peroxisome proliferator-activated receptor gamma
Name:Peroxisome proliferator-activated receptor gamma
Type:Nuclear Receptor
Mol. Mass.:57613.46
Organism:Homo sapiens (Human)
Description:P37231
Residue:505
BDBM50109546
NameBDBM50109546
Synonyms:5-[(3aS,4R,5R,6aS)-5-Hydroxy-4-((S)-3-hydroxy-oct-1-enyl)-hexahydro-pentalen-(2Z)-ylidene]-pentanoic acid CARBACYCLIN PGI2
TypeSmall organic molecule
Emp. Form.C21H34O4
Mol. Mass.350.4923
SMILESCCCCC[C@H](O)\C=C\[C@H]1[C@H](O)C[C@@H]2C\C(C[C@H]12)=C\CCCC(O)=O