Reaction Details
TargetPeroxisome proliferator-activated receptor alpha
LigandBDBM24566
Substrate/Competitorn/a
Meas. Tech.ChEMBL_153713 (CHEMBL759644)
EC50 2100±n/a nM
Citation Sauerberg, PBury, PSMogensen, JPDeussen, HJPettersson, IFleckner, JNehlin, JFrederiksen, KSAlbrektsen, TDin, NSvensson, LAYnddal, LWulff, EMJeppesen, L Large dimeric ligands with favorable pharmacokinetic properties and peroxisome proliferator-activated receptor agonist activity in vitro and in vivo. J Med Chem46:4883-94 (2003) 
 
Peroxisome proliferator-activated receptor alpha
Name:Peroxisome proliferator-activated receptor alpha
Type:PROTEIN
Mol. Mass.:52374.28
Organism:Rattus norvegicus
Description:ChEMBL_834194
Residue:468
BDBM24566
NameBDBM24566
Synonyms:2-({4-chloro-6-[(2,3-dimethylphenyl)amino]pyrimidin-2-yl}sulfanyl)acetic acid JMC515449 Compound 1 Wyeth 14,643
TypeSmall organic molecule
Emp. Form.C14H14ClN3O2S
Mol. Mass.323.798
SMILESCc1cccc(Nc2cc(Cl)nc(SCC(O)=O)n2)c1C