Reaction Details
TargetPlatelet-derived growth factor receptor beta
LigandBDBM50132230
Substrate/Competitorn/a
Meas. Tech.ChEMBL_158653 (CHEMBL763439)
IC50>30000±n/a nM
Citation Matsuno, KUshiki, JSeishi, TIchimura, MGiese, NAYu, JCTakahashi, SOda, SNomoto, Y Potent and selective inhibitors of platelet-derived growth factor receptor phosphorylation. 3. Replacement of quinazoline moiety and improvement of metabolic polymorphism of 4-[4-(N-substituted (thio)carbamoyl)-1-piperazinyl]-6,7-dimethoxyquinazoline derivatives. J Med Chem46:4910-25 (2003) 
 
Platelet-derived growth factor receptor beta
Name:Platelet-derived growth factor receptor beta
Type:Enzyme
Mol. Mass.:123922.25
Organism:Homo sapiens (Human)
Description:P09619
Residue:1106
BDBM50132230
NameBDBM50132230
Synonyms:4-(6,7,8-Trimethoxy-quinazolin-4-yl)-piperazine-1-carboxylic acid (4-phenoxy-phenyl)-amide | CHEMBL100734
TypeSmall organic molecule
Emp. Form.C28H29N5O5
Mol. Mass.515.5604
SMILESCOc1cc2c(ncnc2c(OC)c1OC)N1CCN(CC1)C(=O)Nc1ccc(Oc2ccccc2)cc1