Reaction Details
TargetPlatelet-derived growth factor receptor beta
LigandBDBM50117352
Substrate/Competitorn/a
Meas. Tech.ChEMBL_158653 (CHEMBL763439)
IC50 10±n/a nM
Citation Matsuno, KUshiki, JSeishi, TIchimura, MGiese, NAYu, JCTakahashi, SOda, SNomoto, Y Potent and selective inhibitors of platelet-derived growth factor receptor phosphorylation. 3. Replacement of quinazoline moiety and improvement of metabolic polymorphism of 4-[4-(N-substituted (thio)carbamoyl)-1-piperazinyl]-6,7-dimethoxyquinazoline derivatives. J Med Chem46:4910-25 (2003) 
 
Platelet-derived growth factor receptor beta
Name:Platelet-derived growth factor receptor beta
Type:Enzyme
Mol. Mass.:123922.25
Organism:Homo sapiens (Human)
Description:P09619
Residue:1106
BDBM50117352
NameBDBM50117352
Synonyms:4-[6-Methoxy-7-(2-methoxy-ethoxy)-quinazolin-4-yl]-piperazine-1-carboxylic acid (4-phenoxy-phenyl)-amide | CHEMBL339685
TypeSmall organic molecule
Emp. Form.C29H31N5O5
Mol. Mass.529.5869
SMILESCOCCOc1cc2ncnc(N3CCN(CC3)C(=O)Nc3ccc(Oc4ccccc4)cc3)c2cc1OC