Reaction Details
TargetPlatelet-derived growth factor receptor beta
LigandBDBM50134879
Substrate/Competitorn/a
Meas. Tech.ChEMBL_158653 (CHEMBL763439)
IC50>30000±n/a nM
Citation Matsuno, KUshiki, JSeishi, TIchimura, MGiese, NAYu, JCTakahashi, SOda, SNomoto, Y Potent and selective inhibitors of platelet-derived growth factor receptor phosphorylation. 3. Replacement of quinazoline moiety and improvement of metabolic polymorphism of 4-[4-(N-substituted (thio)carbamoyl)-1-piperazinyl]-6,7-dimethoxyquinazoline derivatives. J Med Chem46:4910-25 (2003) 
 
Platelet-derived growth factor receptor beta
Name:Platelet-derived growth factor receptor beta
Type:Enzyme
Mol. Mass.:123922.25
Organism:Homo sapiens (Human)
Description:P09619
Residue:1106
BDBM50134879
NameBDBM50134879
Synonyms:4-(1,3-Dibutyl-2-oxo-2,3-dihydro-1H-imidazo[4,5-g]quinazolin-8-yl)-piperazine-1-carboxylic acid (4-phenoxy-phenyl)-amide | CHEMBL145179
TypeSmall organic molecule
Emp. Form.C34H39N7O3
Mol. Mass.593.7186
SMILESCCCCn1c2cc3ncnc(N4CCN(CC4)C(=O)Nc4ccc(Oc5ccccc5)cc4)c3cc2n(CCCC)c1=O