Reaction Details
TargetPlatelet-derived growth factor receptor beta
LigandBDBM50134898
Substrate/Competitorn/a
Meas. Tech.ChEMBL_158653 (CHEMBL763439)
IC50 80±n/a nM
Citation Matsuno, KUshiki, JSeishi, TIchimura, MGiese, NAYu, JCTakahashi, SOda, SNomoto, Y Potent and selective inhibitors of platelet-derived growth factor receptor phosphorylation. 3. Replacement of quinazoline moiety and improvement of metabolic polymorphism of 4-[4-(N-substituted (thio)carbamoyl)-1-piperazinyl]-6,7-dimethoxyquinazoline derivatives. J Med Chem46:4910-25 (2003) 
 
Platelet-derived growth factor receptor beta
Name:Platelet-derived growth factor receptor beta
Type:Enzyme
Mol. Mass.:123922.25
Organism:Homo sapiens (Human)
Description:P09619
Residue:1106
BDBM50134898
NameBDBM50134898
Synonyms:4-[6-Methoxy-7-(2-methoxy-ethoxy)-quinazolin-4-yl]-piperazine-1-carbothioic acid (benzo[1,3]dioxol-5-ylmethyl)-amide | CHEMBL147277
TypeSmall organic molecule
Emp. Form.C25H29N5O5S
Mol. Mass.511.593
SMILESCOCCOc1cc2ncnc(N3CCN(CC3)C(=S)NCc3ccc4OCOc4c3)c2cc1OC